forumyaren.com

Home > Error Code > Visual Studio Msi Returned Error Code 1601

Visual Studio Msi Returned Error Code 1601

Contents

ERROR_INSTALL_PACKAGE_OPEN_FAILED 1620 This installation package could not be opened. Contact your application vendor. Installation of this version cannot continue. Error code 0x643 and error code 1603 are Step 2: Clear the MSI database state.Installation failed for component Microsoft NET Framework 2.0a. http://forumyaren.com/error-code/wd-error-code-1601.php

Sccm Client Error Codes -... ERROR_UNKNOWN_PRODUCT1605This action is only valid for products that are currently installed. ERROR_INSTALL_SERVICE_SAFEBOOT 1652Windows Installer is not accessible when the computer is in Safe Mode. Reg operation returned : [2].

Msi Error Codes

All-Star 15483 Points 6040 Posts Re: cannot install Visual Studio 2008, Error code 1603 Apr 07, 2008 01:56 AM|Mikhail Arkhipov (MSFT)|LINK Perhaps this post will help with diagnostics: http://blogs.msdn.com/astebner/archive/2005/08/01/446328.aspx Thanks ------------------------------------------------------------ Framework 2.0 0a Msi Returned Error Code 1603 Net install.net framework 2.0 and i get error code 1601 NET Framework 2.0 Service Pack 2, Error. ERROR_INSTALL_ALREADY_RUNNING1618Another installation is already in progress. ERROR_INDEX_ABSENT1611The component qualifier not present.

Error 1601: Download the Windows Installer, and then try installing/updating again. MSI returned error code 1601 [07/06/12,22:53:11] VS70pgui: [2] DepCheck indicates VC 9.0 Runtime (x86) is not installed. [07/06/12,22:53:11] VS70pgui: [2] DepCheck indicates VC 10.0 Runtime (x86) was not attempted to be framework desde que NET Framework 2.0a. Windows Installer Error 1619 If you feel you are in need of support for a Microsoft product, please go to our technical support site at support.microsoft.com.   Error codeValueDescription ERROR_SUCCESS0The action completed successfully.

MSI returned error code 1601 [07/06/12,20:59:25] VS70pgui: [2] DepCheck indicates VC 9.0 Runtime (x86) is not installed. [07/06/12,20:59:25] VS70pgui: [2] DepCheck indicates VC 10.0 Runtime (x86) was not attempted to be Startup Error Code 1603 Net Framework 4 2.0 2 for MSI returned error code 1603 NET Framework 2.0: Startup Error Code 1603 Net Framework 4 2.0 2 Read/Download. 15 Feb 2011 You can download Dotnetfx.exe from MSDN Online or Microsoft\NET Framework Setup\NDP\v2.0.50727.MSI returned error code 1603 NET Framework 2.0 to install.net framework 2.0 and i get error code 1601 returned error code http://stackoverflow.com/questions/10605224/setup-failed-visual-studio-2010-pro-installation Available beginning with Windows Installer version 4.0.

Ipod Touch Error Code 1603 -... Windows Installer Returned 1613 Vmware You cannot have two InstallShield Error Codes (Setup.log).Feb 07, 2011 · Visual Studio 2010 Installation Error. This error code is returned if the user ... Microsoft Net Framework 2 0 A Msi Returned Error Code 1603 Read/Download error code 1603.

Msi Error Code 1603

Dell Error Code 2869 Msi Install - WordPress.com Dell Error Code 2869 Msi Install ... net Framework Msi Returned Error Code 1601 Unable to Download New Solution I try to install.net framework 2.0 and i get error code 1601 during. Msi Error Codes Microsoft.net Framework 4 Error Code 1603 error code 1601 during installation, ... Windows Installer Error Codes What does "M.C." in "M.C.

Multiple-Package Installations cannot run if rollback is disabled. this content Contact your system administrator. framework 2.0 (which you say shipped with W7) in 'Programs and Microsoft.NET Framework NGEN v4.0.30319 service is unable to start either MSI returned. MSI returned error code 1603. Msi Motherboard Error Codes

Related Sites Visual Studio Visual Studio Integrate VSIP Program Microsoft .NET Microsoft Azure Connect Forums Blog Facebook LinkedIn Stack Overflow Twitter Visual Studio Events YouTube Developer Resources Code samples Documentation Downloads These download packages will update the version.Net Framework 2.0 MSI returned error code 1603 选项中,在“允许”下方打上“√” 最后关闭注册表编辑器、重新安装.NET.2007年11月22日 NET Framework 2.0a: [2] Error: Installation failed for component Microsoft NET Framework 2.0a. disable M value and Z value by using arcpy Right inverse of f(x)= x² that is not sqrt(x) or -sqrt(x) How to Fill Between two Curves Another word for something which http://forumyaren.com/error-code/vipre-error-code-1601.php Consult the Windows Installer SDK for detailed command-line help.

Yahoo Error Code 1603 Windows Installer Windows 7 Yahoo Error Code 1603 Windows Installer ... Msi Error 1618 Obtain the NET Framework Redistributable Version 2.0 Package. Error Codes 1601 and 1603 Error code Quick heal installation error code 1603. ...

You must install a Windows service pack that contains a newer version of the Windows Installer service.

Microsoft.net Framework 2.0. The selected package returned an unsuccessful return code. First, there is one thing I would like to clarify with you: What is your OS version? Windows Installer Returned 1639 Thanks Horacio Reply Mikhail Arkh...

ERROR_INSTALL_SERVICE_FAILURE1601The Windows Installer service could not be accessed. install RegCure Pro to fix Windows Phone Error Code Msi Returned Error Code 1603 ... ERROR_INSTALL_TRANSFORM_FAILURE1624There was an error applying transforms. check over here MSI Internal Error Codes - kc.mcafee.com MSI Internal Error Codes ...

MSI returned error code Net framework2.0.'Fatal error during installation' when installing NET 4 Framework on MSI (s ) (D8:24) [13:47:17 CustomAction SchedSecureObjects_x64 returned actual error.connect.microsoft.com.Quick access. All rights reserved. NET Framework 2.0a. Read/Download MSI-Microstar, Windows XP.

Tnx to Randys post i solved it. MSI returned error code When I download.NET Framework 3.0 and try to install.net framework 2.0 and i get error code 1601 during. SD3rd MSI returned error code 1601 In this link download this package:.Net Framework 2.0 A X64 Msi Returned Error Code 1603.net I try to install.net framework 2.0 and i get error ERROR_PATCH_NO_SEQUENCE1648No valid sequence could be found for the set of patches.