forumyaren.com

Home > Visual Studio > Visual Studio 2005 Sdk Failed Error Code = 2

Visual Studio 2005 Sdk Failed Error Code = 2

Contents

Runtime only option may work too but I didn't test it. cwd E:\GitHub\jquery-mobile\node_modules\jquery\node_modules\contextify gyp ERR! Thats why I'm thinking that I have beta version 🙁 Reply Ray says: May 22, 2006 at 1:26 am I found another very strange thing. But under JavaScript > Windows > Windows Universal there is still only the Blank App template and the "Download Windows Universal Tools" template that originally took me to the download page navigate here

We recommend upgrading to the latest Safari, Google Chrome, or Firefox. Error code :2005 It can be a system error ora Terminal Server error. Reply George_L_UK says: September 23, 2007 at 6:31 am Hi Aaron, I'm finding an error installing .NET 2.0 and recieve the following error report. I'd bet you guys rushed a little this time. https://blogs.msdn.microsoft.com/astebner/2005/11/14/visual-studio-2005-and-net-framework-2-0-setup-troubleshooting-guide/

Visual Studio 2015 0x80044000

Sign in to comment Contact GitHub API Training Shop Blog About © 2016 GitHub, Inc. Reply Ray says: May 19, 2006 at 2:23 am Thanks. And I'm running in XP SP3.

Installing VS2015 now. --- fixed it mizhon commented Dec 30, 2015 me too, same error happened when typing command: npm start tomhicz commented Jan 22, 2016 After running into this error What is error code S1023? not ok npm ERR! Error Visual Studio I'm not sure if there's much what the protractor team can do.

I did do a repair of VS 2015 installation and it detected Windows 10 sdk exists in the logs as well but no entry in the new project dialog. –Shubhan May Visual Studio Error 2147205120 Since the issue still exists per above comments, re-open this issue. not ok code 0 Windows 7 / 64 bit, I do have installed "Microsoft Windows SDK for Windows Server 2008" as well as Visual Studio 2013. https://blogs.msdn.microsoft.com/heaths/2014/04/17/error-in-installation-log-for-visual-studio-2013-update-2-rc-can-be-misleading/ Loading...

npm ERR! Visual Studio 2015 Update 3 Browse other questions tagged directx vista64 or ask your own question. Most of the cases I have seen where that custom action (CA) failed, the user was able to fix it by rebooting and restarting setup again. Only solution which worked for me was: # run in administrator privileged command prompt window npm install --global --production windows-build-tools and after that i ran : npm update which successfully fixed

Visual Studio Error 2147205120

TechStorey 976 views 2:42 How To Download And Install Visual Studio 2015 - Duration: 3:41. Ask a question Quick access Forums home Browse forums users FAQ Search related threads Remove From My Forums Answered by: I have a problem in the installation of Windows 10 SDK Visual Studio 2015 0x80044000 Source: https://social.msdn.microsoft.com/Forums/en-US/17bc9d5e-2ea7-4149-bb75-23997db8bd25/known-issue-emulators-for-windows-mobile-10010069-the-installer-failed-user-cancelled?forum=Win10SDKToolsIssues I cannot speak for the solutions' effectiveness personally, but it was a marked answer. Visual Studio Error Code stack at ChildProcess.onExit (C:\Program Files\nodejs\node_modules\ npm\node_modules\node-gyp\lib\build.js:270:23) gyp ERR!

command "node" "d:\\Developpement\\nodejs\\node_modules\\npm\\node_modules\\node-gyp\\bin\\node-gyp.js" "rebuild" gyp ERR! check over here stack at ChildProcess.emit (events.js:172:7) gyp ERR! Reply horaciotg Member 1 Points 42 Posts Re: cannot install Visual Studio 2008, Error code 1603 Apr 13, 2008 01:42 AM|horaciotg|LINK Thanks for your help, I solved my problemfollowing these steps: node-gyp -v v0.10.6 gyp ERR! Visual Studio 2015 Fatal Error During Installation

Reply Aaron Stebner says: December 15, 2005 at 12:35 pm Hi Ivan - The install and uninstall process is definitely not perfect, but I think it has evolved well over the You can send them to [email protected] stack at emitTwo (events.js:87:13) gyp ERR! his comment is here Sign in Statistics 14,006 views 29 Like this video?

For more information, see SccSetOption Function.SCC_I_FILEDIFFERS6The local file is different from the file in the source control database (for example, SccDiff Function may return this value).SCC_I_RELOADFILE5Local file was changed during the Visual Studio Community sln] gyp ERR! command "node" "C:\\local\\nodejs\\node_modules\\npm\\node_modules\\node-gyp\\bin\\node-gyp.js" "rebuild" gyp ERR!

Um eine parallele Erstellung zu ermöglichen, müssen Sie den Schalter "/m" hinzufügen.

I would suggest installing Visual Studio Express 2013 for Windows Desktop. You signed out in another tab or window. And it should not be mandatory to have it installed to be able to install Protractor, I think. Visual Studio Code If you need help, you may report this log at: npm ERR! npm ERR!

Errors were encountered during installation of redistributable packages. juberjj commented May 26, 2016 @black-snow VS2013 now but tried 2015 before with the same end result. Thanks, Gary Reply Aaron Stebner says: April 14, 2006 at 6:15 pm Hi Gary - This could be a volume label issue. http://forumyaren.com/visual-studio/visual-studio-2005-ide-error.php To enable parallel build, please add the "/m" switch.

I'll try the other way around. not ok [email protected] install C:\try1\node_modules\socket.io\node_modules\engine.io \node_modules\ws\node_modules\bufferutil node-gyp rebuild C:\try1\node_modules\socket.io\node_modules\engine.io\node_modules\ws\node_modul es\bufferutil>if not defined npm_config_node_gyp (node "C:\Program Files\nodejs\ node_modules\npm\bin\node-gyp-bin\....\node_modules\node-gyp\bin\node-gyp.js" rebuild ) else (node rebuild ) Building the projects in this solution one at Its working now. Personal Open source Business Explore Sign up Sign in Pricing Blog Support Search GitHub This repository Watch 407 Star 5,977 Fork 1,406 angular/protractor Code Issues 142 Pull requests 12 Projects

stack at ChildProcess.onExit (d:\Developpement\nodejs\node_modules\npm\node_modules\node-gyp\lib\build.js:267:23) gyp ERR! cwd C:\try1\node_modules\socket.io\node_modules\socket.io-client\node_m odules\engine.io-client\node_modules\ws\node_modules\bufferutil gyp ERR! stack at ChildProcess.onExit (D:\nodejs\node_modules\npm\node_modul es\node-gyp\lib\build.js:267:23) gyp ERR!