forumyaren.com

Home > Visual Studio > Visual Studio 2012 Link Error 2019

Visual Studio 2012 Link Error 2019

Join them; it only takes a minute: Sign up “error LNK2019: unresolved external symbol” error in Visual Studio 2010 up vote 2 down vote favorite 1 I'm trying to compile and I have added the header file using this path: project's Properties (in C/C++ -> General -> Additional Include Directories) Also i have linked the library using this path: Project Properties -> This import library lists all the goodies provided by the *.DLL. Yet Another, Another Prime Generator Securing a LAN that has multiple exposed external at Cat 6 cable runs? navigate here

As for the combination of defines etc, do not define MJ_STATIC, this is for internal use only. What is the purpose of the box between the engines of an A-10? Thanks again, Matthias      Top Back to original post Leave a Comment Please sign in to add a comment. You must use the /Zc:wchar_t- compiler option to generate code compatible with library and object files compiled by using earlier versions of Visual C++.

H:\Desktop\mjhaptix131\apicpp> Examining the exported symbols from the dll and the lib, dumpbin says: Code: H:\Desktop\mjhaptix131\apicpp>dumpbin mjhaptix_user.dll /exports Microsoft (R) COFF/PE Dumper Version 12.00.31101.0 Copyright (C) Microsoft Corporation. Since your unit tests are in a different project, I'm assuming your intention is to make that project a standalone unit-testing program. Add a project-to-project reference to fix it.You build a console application by using settings for a Windows application. Why can't the second fundamental theorem of calculus be proved in just two lines?

How much more than my mortgage should I charge for rent? Movie about encountering blue alien What is mathematical logic? Thanks) c++ testing error-handling lnk2019 share|improve this question edited Nov 10 '13 at 5:00 asked Nov 10 '13 at 4:47 user2447581 69321017 possible duplicate of What is an undefined Should the sole user of a *nix system have two accounts?

I wonder if the following could be the problem. Please click the link in the confirmation email to activate your subscription. Is there an English idiom for provocative titles, something like "yellow title"? have a peek at these guys An Error Occurred Unable to complete the action because of changes made to the page.

Finally, you are done! Should I replace with #include "../MyProjectTest/function.cpp" in file unittest.cpp? (I'm not good at english very much. C/C++ Building Reference C/C++ Build Errors Linker Tools Errors and Warnings Linker Tools Errors and Warnings Linker Tools Error LNK2019 Linker Tools Error LNK2019 Linker Tools Error LNK2019 Linker Tools Error Using inlined functions defined in .cpp files and mixing function inlining compiler options in different source files can cause LNK2019.

Verify that you only use intrinsics and types supported by your target architecture. http://digital.ni.com/public.nsf/allkb/36F561F57095CADB86257CC4006C275B Top Joel Kindem Mon, 07/02/2012 - 00:56 Steve, I too have had problems linking a fortran dll to my C++ project. Tue, 05/05/2015 - 06:16 Many thanks, Yuri. That should allow your project to build.

cl /O2 /MT /EHsc grasp.cpp mjhaptix_user.lib Microsoft (R) C/C++ Optimizing Compiler Version 18.00.31101 for x86 Copyright (C) Microsoft Corporation. check over here Linker Tools Error LNK2019 Visual Studio 2015 Other Versions Visual Studio 2013 Visual Studio 2012 Visual Studio 2010 Visual Studio 2008 Visual Studio 2005 Visual Studio .NET 2003  unresolved external symbol This is the error: openCV_testing.obj : error LNK2019: unresolved external symbol _cvDestroyWindow referenced in function _main openCV_testing.obj : error LNK2019: unresolved external symbol _cvReleaseImage referenced in function _main openCV_testing.obj : error Can Wealth be used as a guide to what things a PC could own at a given level?

more stack exchange communities company blog Stack Exchange Inbox Reputation and Badges sign up log in tour help Tour Start here for a quick overview of the site Help Center Detailed A build dependency is only defined as a project dependency in the solution. Simply Riddleculous more hot questions question feed lang-c about us tour help blog chat data legal privacy policy work here advertising info mobile contact us feedback Technology Life / Arts Culture his comment is here Play games and win prizes!

C++ Copy // LNK2019b.cpp // Compile by using: cl /EHsc LNK2019b.cpp // LNK2019 expected struct C { static int s; }; // Uncomment the following line to fix the error. // How or where should I add a required connection string for a feature in Helix? What are the computer-like objects in the Emperor's throne room?

C++ language conformance work that was done in Visual C++ 2005 made wchar_t a native type by default.

Emo Todorov, Jul 1, 2016 #9 (You must log in or sign up to reply here.) Show Ignored Content Your name or email address: Do you already have an account? Calling conventions (__cdecl, __stdcall, __fastcall, or __vectorcall) are encoded as part of the decorated name. I'm using Visual Studio 2013. You can turn your first program into a static library by changing it in the projects properties.

more stack exchange communities company blog Stack Exchange Inbox Reputation and Badges sign up log in tour help Tour Start here for a quick overview of the site Help Center Detailed With VS15 this worked for me, but then again, the original also worked... Dump of file gausfit.lib File Type: LIBRARY Exports ordinal name Linefit Minuit g2 gausfit1 grand sinfit Summary C6 .debug$S 14 .idata$2 14 .idata$3 4 .idata$4 4 .idata$5 C .idata$6 I paste weblink Instead of generating an inline instruction, the compiler generates a call to an external symbol with the same name as the intrinsic.

Not the answer you're looking for? Learning resources Microsoft Virtual Academy Channel 9 MSDN Magazine Community Forums Blogs Codeplex Support Self support Programs BizSpark (for startups) Microsoft Imagine (for students) United States (English) Newsletter Privacy & cookies The error message shows you both the external symbol and its decorated name to help you find the cause of the error. Verify that the calling convention is the same.A symbol is defined in a C file, but declared without using extern "C" in a C++ file.

wlorenz65, Jun 21, 2016 #1 Emo Todorov Administrator Staff Member MuJoCo HAPTIX is compiled with Visual Studio 2015, and nmake works fine with the grasp.cpp example. There should be an option under the General tab where the project is set to build to an executable (.exe). Your active solution platform is X64 but you are trying to link x86 OpenCV libraries. But why?

EDIT: This help explains it: stackoverflow.com/questions/3484434/… –shim Jan 13 at 21:47 add a comment| up vote 1 down vote i searched a lot for the same problem this was the best Maybe in 2012/2013, 64bit executables were too rare. Quicker and quieter than a mouse, what am I? All rights reserved.

share|improve this answer answered Mar 19 at 1:35 Mehdi Benkirane 13614 add a comment| up vote 0 down vote I had a similar issue and the problem was mixing a x64 Contact Us Help Home Top RSS Skip to main content Developer Zone Join today Log in DevelopmentOSAndroid*Chrome*HTML5Windows*Device2-in-1 & Ultrabook™Business ClientEmbedded SystemsIoTServer, Workstation, HPCTechnologyBig DataDual ScreenGame DevIntel® RealSense™ISA ExtensionsMachine LearningModern CodeNetworkingOpen SourceStorageToolsDeveloper Browse other questions tagged c visual-studio-2010 lnk2019 libsndfile or ask your own question. In either the LNK2001 or LNK2019 cases, I believe the external symbols to the Fortran should get resolved by the inclusion of the path to the flib .lib file that I've

Inserting DECORATE tells Fortran to do whatever the appropriate decoration is for the platform.