forumyaren.com

Home > Visual Studio > Visual Studio Error C2006

Visual Studio Error C2006

I just went to his github repository and he had a version there that compiled mostly fine in visual studio after defining a macro FT2_BUILD_LIBRARY. –Goldboa Sep 5 '15 at 8:27 Most compiler systems have tutorial and/or example projects that can be accessed through the "help" menu. I think I need to withdraw, prepare, and try again. Close Box Join Tek-Tips Today! navigate here

Interlace strings How to grep rows that have certain value in a specific column? I don't see where else to try to fix it. asked 6 years ago viewed 6626 times active 6 years ago Blog Stack Overflow Podcast #93 - A Very Spolsky Halloween Special Related 1160What is the difference between #include and The program '[6128] ConsoleApplication6.exe' has exited with code 0 (0x0). https://msdn.microsoft.com/en-us/library/dc232hsx.aspx

Why does WordPress use outdated jQuery v1.12.4? more stack exchange communities company blog Stack Exchange Inbox Reputation and Badges sign up log in tour help Tour Start here for a quick overview of the site Help Center Detailed Not the answer you're looking for? Posting Guidelines Promoting, selling, recruiting, coursework and thesis posting is forbidden.Tek-Tips Posting Policies Jobs Jobs from Indeed What: Where: jobs by Link To This Forum!

Join your peers on the Internet's largest technical computer professional community.It's easy to join and it's free. All rights reserved. Question: Huh? Now what will happen if you don't define FT_BBOX_H?

So including "Gradebook.h" again defines the Gradebook class again (redefines it). 5. It was generated when I created the workspace...Can I kill myself now? Thanx, Arlene #2 11-Jul-2007, 18:54 Kimmo Regular Member Join Date: Mar 2007 Location: Finland Posts: 450 Re: Help! http://stackoverflow.com/questions/6074039/visual-c-express-2010-suddenly-wont-accept-includes I'm developing in Visual C++ 2010 Express, and it's been working fine up till now.

Advisor professor asks for my dissertation research source-code Can Wealth be used as a guide to what things a PC could own at a given level? Talk With Other Members Be Notified Of ResponsesTo Your Posts Keyword Search One-Click Access To YourFavorite Forums Automated SignaturesOn Your Posts Best Of All, It's Free! By joining you are opting in to receive e-mail. Here it is: c:\arlene documents\schools\strayer\courses\c++\gradebook\gr adebook.h(9) : error C2011: 'GradeBook' : 'class' type redefinition Here is the code for Gradebook.h: CPP / C++ / C Code:

#include  

Click Here to join Tek-Tips and talk with other members! http://www.cplusplus.com/forum/beginner/172273/ contact us Login with LinkedIN Or Log In Locally Email Password Remember Me Forgot Password?Register ENGINEERING.com Eng-Tips Forums Tek-Tips Forums Search Posts Find A Forum Thread Number Find An Expert c++ visual-c++ header include compiler-errors share|improve this question edited Sep 19 '10 at 5:12 codaddict 253k50364444 asked Sep 18 '10 at 18:07 Anant 7928 add a comment| 2 Answers 2 active If you dance barefoot on the broken glass of undefined behaviour, you've got to expect the occasional cut.

Symbols loaded. 'ConsoleApplication6.exe' (Win32): Loaded 'C:\Windows\SysWOW64\KernelBase.dll'. http://forumyaren.com/visual-studio/visual-studio-next-error.php Compiler Error Code C2006 Quote: Originally Posted by ArleneM c:\arlene documents\schools\strayer\courses\c++\gradebook\gr adebook.h(9) : error C2011: 'GradeBook' : 'class' type redefinition Let's try a little logic: 1. What is the purpose of the box between the engines of an A-10? Join Us! *Tek-Tips's functionality depends on members receiving e-mail.

How do really talented people in academia think about people who are less capable than them? Cancel Red Flag SubmittedThank you for helping keep Tek-Tips Forums free from inappropriate posts.The Tek-Tips staff will check this out and take appropriate action. Not the answer you're looking for? http://forumyaren.com/visual-studio/visual-studio-error-hr.php RE: error c2006: '#using'; expected a filename, found 'namespace' cpjust (Programmer) 8 Mar 05 10:12 The 'using' keyword isn't a preprocessor directive, so don't include the # at the beginning.CODEusing namespace

more stack exchange communities company blog Stack Exchange Inbox Reputation and Badges sign up log in tour help Tour Start here for a quick overview of the site Help Center Detailed Get Started with C or C++ C Tutorial C++ Tutorial Get the C++ Book All Tutorials Advanced Search Forum General Programming Boards C++ Programming y am i getting these errors Getting Go to the Debug tab and click "Start without debugging" or use the key shortcut.

Arithmetic or Geometric sequence?

But im here Join Date Apr 2005 Location England Posts 1,614 That code is quite hard to read. All I did was move the GradeBook.h file to a different folder to correct the error that the compiler couldn't find that file. There was a few problems. It may help if you added a little whitespace to ease readability and it will help you greatly when it comes to debugging the code.

I've been following the "Install.any" guide included in the freetype download, but when I try to compile I get the errors Error 10 error C2006: '#include' : expected a filename, found The directive is being processed before the macro is completely expanded, resulting in the error. English fellow vs Arabic fellah Right inverse of f(x)= x² that is not sqrt(x) or -sqrt(x) What are the computer-like objects in the Emperor's throne room? weblink Now I get this: error C2006: '#include' : expected a filename, found 'identifier' fatal error C1083: Cannot open include file: '': No such file or directory What is causing this?

Can I "build" a TDS project without having it attempt to deploy? If it's not absolutely necessery to include such files, why not remove it? #3 12-Jul-2007, 01:44 LuciWiz Moderator Join Date: Jul 2004 Location: Cluj-Napoca (Romania) Posts: 1,037 Re: I'll try one more time and then give up if I'm not successful. I I hope you don't think I was deliberately talking down to you or that I meant anything negative when I asked the seemingly simple-minded questions.

Answer: You are compiling your main program file, so look at it. All rights reserved.Unauthorized reproduction or linking forbidden without expressed written permission. Using "están" vs "estás" when refering to "you" What is mathematical logic? The entire stdafx.cpp file: CPP / C++ / C Code:

#include "stdafx.h" CL /YcGradebook.h PROG.CPP
The errors: gradebook\stdafx.cpp(7) : error C2143: syntax error : missing ';' before

The following sample generates C2006: Copy // C2006.cpp #include stdio.h // C2006 Possible resolution: Copy // C2006b.cpp // compile with: /c #include Show: Inherited Protected Print Export (0) Print Export Forum Today's Posts C and C++ FAQ Forum Actions Mark Forums Read Quick Links View Forum Leaders What's New? Symbols loaded. How to restrict InterpolatingFunction to a smaller domain?