forumyaren.com

Home > Visual Studio > Visual Studio Error C2146

Visual Studio Error C2146

Which is the most acceptable numeral for 1980 to 1989? I will edit to make that clear. –Mysticial Oct 18 '11 at 4:40 add a comment| up vote 1 down vote Your "common.h" header does not define MyStruct properly; it needs If that typedef is exactly what you have in your common.h, it won't work. asked 2 years ago viewed 1007 times active 2 years ago Blog Stack Overflow Podcast #93 - A Very Spolsky Halloween Special Related 0C2146 Missing ; in Visual Studio 2010-8Error c4430 http://forumyaren.com/visual-studio/visual-studio-sp1-error.php

What does "M.C." in "M.C. Note: C++ does not support default-int] comes as a result of the first error. Join them; it only takes a minute: Sign up C4430 and C2146 Visual Studio errors up vote 1 down vote favorite I have searched through many posts on here and cannot Why are only passwords hashed? https://msdn.microsoft.com/en-us/library/9xbcaa9t.aspx

Please chime in there. I don't understand what is happening lol. Dev centers Windows Office Visual Studio Microsoft Azure More...

Show a minimal sample program which can be compiled and which generates these errors. - Wayne Tuesday, July 24, 2012 6:47 AM Reply | Quote 0 Sign in to vote Have How is Filter::apply defined? –user3553031 Jul 5 '14 at 18:06 Filter::apply is defined in FilterGreen.cpp bool FilterGreen::apply(Image& img, const std::string filtername){ for (unsigned int f = 1; f < Show all of the #include statements in the program which generates these errors. - Wayne Marked as answer by Helen Zhao Tuesday, July 31, 2012 3:27 AM Wednesday, July 25, 2012 Note: C++ does not support default-int In my cpp file I have scope resolution operators and I don't have any squiggly red lines under anything.

In the line virtual bool apply(Image& img, const string filtername); in filter.h, is string in scope? Why does typography ruin the user experience? Visual studio can sometimes goof at least until your solution is fully parsed, but this is more of a problem on very large projects where parsing takes some time. More about the author How does Energy Field interact with effects that say you lose life?

Problems associated with booking flights inside another set of flights? If you choose to participate, the online survey will be presented to you when you leave the Msdn Web site.Would you like to participate? Was This Post Helpful? 0 Back to top MultiQuote Quote + Reply #3 grasmanek94 New D.I.C Head Reputation: 0 Posts: 48 Joined: 11-July 11 Re: error C2146: syntax error : Note: C++ does not support default-int c:\users\zahrina\documents\visual studio 2012\projects\gaschedule\gaschedule\schedule.h(187): error C2146: syntax error : missing ';' before identifier '_instanceSect' c:\users\zahrina\documents\visual studio 2012\projects\gaschedule\gaschedule\schedule.h(187): error C4430: missing type specifier - int assumed.

Not the answer you're looking for? more stack exchange communities company blog Stack Exchange Inbox Reputation and Badges sign up log in tour help Tour Start here for a quick overview of the site Help Center Detailed What are the computer-like objects in the Emperor's throne room? I did have it as fstream.h But VC++ was not recognizing it so I was told to remove the h and I did.

We recommend upgrading to the latest Safari, Google Chrome, or Firefox. http://forumyaren.com/visual-studio/visual-studio-net-error.php share|improve this answer answered Jul 5 '14 at 17:58 user3553031 4,3381527 Thanks for the reply! Yet Another, Another Prime Generator Was user-agent identification used for some scripting attack techique? How to restrict InterpolatingFunction to a smaller domain?

asked 6 years ago viewed 5713 times active 5 years ago Blog Stack Overflow Podcast #93 - A Very Spolsky Halloween Special Get the weekly newsletter! How much more than my mortgage should I charge for rent? Not the answer you're looking for? his comment is here more stack exchange communities company blog Stack Exchange Inbox Reputation and Badges sign up log in tour help Tour Start here for a quick overview of the site Help Center Detailed

disable M value and Z value by using arcpy How much more than my mortgage should I charge for rent? I am getting two errors when I try to compile my program, both of them are coming from one of my header files. Thanks, Renjith V R Tuesday, July 24, 2012 10:51 AM Reply | Quote 0 Sign in to vote This may be a matter of having the wrong order of #include statements.

Seasonal Challenge (Contributions from TeXing Dead Welcome) Is there an English idiom for provocative titles, something like "yellow title"?

A crossword so simple, it practically solves itself Trick or Treat polyglot finding a word in a string How to Fill Between two Curves Subtracting empty set from another Output a Which is the most acceptable numeral for 1980 to 1989? Second, you should define the struct like this: // common.h typedef struct { int a; } MyStruct; Alternatively, you can define it like this: // common.h struct MyStruct { int a; You will need to fix the other error.

Here are de erros: Error 1 error C4430: missing type specifier - int assumed. Browse other questions tagged c++ or ask your own question. asked 1 year ago viewed 537 times active 1 year ago Blog Stack Overflow Podcast #93 - A Very Spolsky Halloween Special Linked 174 Resolve header include circular dependencies Related 0C2146 weblink under nodesinfo?

Produce Dürer's magic square Why can't the second fundamental theorem of calculus be proved in just two lines? The compiler parser keeps reading and treating code as if it's part of that declaration or definition, until it starts finding things that shouldn't be there. And I ran into this error. Solutions?

What happens to all of the options when they expire? Show a minimal sample program which can be compiled and which generates these errors. - Wayne It is ok when used in a small testcase. I dont know what will affect it. This is not my code .

Also the program compiled ONCE and then I saved it and reopened the program and it gave me these errors. now I am down to this error. If so, you'll need another using statement or reference the class in the namespace (YourNamespace::ForexPrices). Possibly something obvious c++ c visual-studio visual-studio-2008 visual-c++ share|improve this question asked May 29 '10 at 18:34 numerical25 3,9042291176 I had this problem, and I was including a header

For code to be valid in the Visual Studio .NET 2003 and Visual Studio .NET versions of Visual C++, replace all instances of the template parameter in the specialization with the explicitly specialized Copy // C2146.cpp class CDeclaredClass {}; class CMyClass { CUndeclared m_myClass; // C2146 CDeclaredClass m_myClass2; // OK }; int main() { int x; int t x; // C2146 : missing semicolon more hot questions question feed default about us tour help blog chat data legal privacy policy work here advertising info mobile contact us feedback Technology Life / Arts Culture / Recreation Thanks!

The compiler parser keeps reading and treating code as if it's part of that declaration or definition, until it starts finding things that shouldn't be there. Why does the kill-screen glitch occur in Pac-man?