Home > Vmware Workstation > Vmware Workstation Fatal Application Error Invalid Path

Vmware Workstation Fatal Application Error Invalid Path

Error: object references an unsaved transient instance - save the transient instance before flushing:; nested exception is org.hibernate.TransientObjectException: object references an unsaved tran 关键词: lt, failure, schema, xxxx, object references, Don't know if these are the cause of failures or not. You can see the issue here: When the machine is setup the paths are incorrectly configured with forward slashes... Note: libxslt may be required for starting virtual machines. this content

Shh. Therefore, use an external tool Middlegen-Hibernate-r5 to carry out the conversion. This is a relatively common error. mitchellh closed this Nov 20, 2013 nelsonlaquet commented Nov 20, 2013 Still having the issue.

The path of shared folders are different between ones from Vagrant (c:/test) and ones manually set(C:\test). nelsonlaquet commented Nov 25, 2013 @InvertedAcceleration how were you able to edit the paths in your VM config? Fetching box from specified URL for the provider 'vmware_workstation'. The one I'm using has VMware Workstation Tools correctly installed.

Oh, that, and Fable 2. Newer Post Older Post Home Subscribe to: Post Comments (Atom) Wael Yousif, Net+, CCNA, CCDA, CCNP(Routing), CCAI, GCFW Followers Blog Archive ▼ 2009 (12) ▼ September (11) Changing permissions on Windows For older versions, use the vmware-patchAUR package. Content is available under GNU Free Documentation License 1.3 or later unless otherwise noted.

If the post at Robby on Rails did not work ... Windows 7 Professional, 64-bit 6.1.7601, Service Pack 1 Vagrant 1.3.5 vagrant-vmware-workstation 2.1.0 VMware Workstation 10.0.1 build-1379776 mc2 referenced this issue Dec 5, 2013 Closed Vagrant uses wrong path separator while The stack pointer has been left in an inconsistent state. mc2 commented Dec 5, 2013 Just got Vagrant VMware a few days ago.

Generating chef JSON and uploading... Some data might have been lost. 0x000002AE ERROR_DLL_MIGHT_BE_INSECURE The application is attempting to run executable code from the module %hs. Note In the following descriptions, a percentage sign followed by one or more alphanumeric characters (for example, "%1" or "%hs") indicates a variable that will be replaced by text at the Follow me on Twitter or Google Plus Copyright ©2016 · Focus Pro Theme on Genesis Framework · WordPress · Log in 首页 资讯 精华 论坛 问答 博客 专栏 群组 更多 ▼

If you're loading apt from another cookbook, make sure you configure the dependency in your metadata Chef never successfully completed! Category: Linux/Unix Community -> Technical Topics Author: zhangliang585 Date: 2013-09-13 20:31:12 zhangliang585 2013-09-13 20:31:12 7.1 Installing VMware virtual machine to the last point when completed: Fatal Application Error: Invalid path. However, this will fail with the error "incorrect username/password" due to incorrect PAM configuration of the vmware-authd service. I could not find a workaround.

GUI doesn't show after upgrade The factual accuracy of this article or section is disputed. Contact your system vendor for system BIOS update. 0x000002A0 ERROR_PNP_TRANSLATION_FAILED A translator failed to translate resources. 0x000002A1 ERROR_PNP_IRQ_TRANSLATION_FAILED An interrupt request (IRQ) translator failed to translate resources. 0x000002A2 ERROR_PNP_INVALID_ID Driver %2 Puppet scripts I developed work fine in virtualbox. "Input/output error" in Vagrant VMWare. +1 vote to reopen. The command and output are below: Command: ["addSharedFolder", "C:/Development/cookbooks/test/.vagrant/machines/default/vmware_workstation/551ede37-8f67-4fbf-a140-7b2909d1dc81/precise64.vmx", "-tmp-vagrant-chef-1-chef-solo-1-cookbooks", "C:/Development/cookbooks/third-party", {:notify=>[:stdout, :stderr]}] Stdout: Error: The VMware Tools are not running in the virtual machine: C:\Development\cookbooks\test\.vagrant\machines\default\vmware_workstation\551ede37-8f67-4fbf-a140-7b2909d1dc81\precise64.vmx Stderr: C:\Development\cookbooks\test> pghalliday commented Sep

Type "logoff", then press "Enter". The caller now needs to enumerate the files to find the changes. 0x0000041B ERROR_DEPENDENT_SERVICES_RUNNING A stop control has been sent to a service that other running services are dependent on. 0x0000041C I'm using a premade box, which had vmware tools installed, i even reinstalled them, it still maps the directory wrong. have a peek at these guys Solution: At appendChild or inne 关键词: ajax, appendchild, sensitive operations, internet explorer, key words Update rails when the error happened, Invalid Gem format 2009-03-15 Today put the version of rails upgrade

The only thing I am unsure of is whether I was using a ubuntu 12.04.2 base install or 12.04.3. Try to login with a new user (if available). If not using the systemd service to automatically handle the services, you need to manually start the vmware-usbarbitrator binary as root each time.

If you feel your password has been compromised, contact your administrator immediately to have a new one assigned. 0x00000269 ERROR_PWD_HISTORY_CONFLICT You have attempted to change your password to one that you

Posted by Proffesor Yousif at 9:01 PM 14 comments: Words from the heartSeptember 14, 2009 at 7:05 PMWhen we are starting the VMware workstation and it asks us for the software, VMware 11 and older require patching the VMCI/VSOCK sources. Vendors SHOULD NOT assign other meanings to these values, to avoid the risk of a collision in the future. I reinstalled vmware tools on the box and halted/restarted it.

Error 127 ) in the output of # systemctl status vmware-workstation-server You may need to execute the following: $ ln -s /usr/lib/vmware/bin/wssc-adminTool /usr/lib/vmware/bin/vmware-wssc-adminTool $ chmod +x /usr/lib/vmware/bin/wssc-adminTool Uninstallation To uninstall VMware Kernel modules fail to build after Linux kernel 4.7 As of VMware Workstation Pro 12.1, the module source needs to be modified to be successfully compiled [2][3]. The remaining data will be sent later. 0x000002C4 ERROR_RECEIVE_EXPEDITED {Expedited Data Received} The network transport returned data to its client that was marked as expedited by the remote system. 0x000002C5 ERROR_RECEIVE_PARTIAL_EXPEDITED check my blog fatal error © all rights reserved.2007-2014Privacy Policy | Disclaimer | Disclosure | Contact|created TechnipagesSmart phone, gadget and computer tipsHome Downloads Topics Android Gaming Hardware Internet iOS Mac Office Software

C:\Development\cookbooks\test> The apt cookbook is present, however if i ssh into the machine and try to ls the cookbooks directory or in fact the vagrant directory, I get the following: [email protected]:~$ Select YES to fail the DLL load. Most values also have a default message defined, which can be used to map the value to a human-readable text message; when this is done, the Win32 error code is also Related posts: Windows "Internal Error 2738" Fix Windows: Disable Prompt to Set IE11 as Default Browser How to Uninstall IE11 From Windows 10 iTunes Crashes in Windows 10 Comments David Raine

Try to save this file elsewhere. 0x00000316 ERROR_LOST_WRITEBEHIND_DATA_LOCAL_DISK_ERROR {Delayed Write Failed} Windows was unable to save all the data for the file %hs; the data has been lost. Go to System in Control Panel to change the computer name, and then try again. 0x00000035 ERROR_BAD_NETPATH The network path was not found. 0x00000036 ERROR_NETWORK_BUSY The network is busy. 0x00000037 ERROR_DEV_NOT_EXIST Re: Invalid Path error creating disk Workstation 6.5 KevinG Nov 7, 2008 2:40 PM (in response to mvandervorst) Select "Help" -> About" and make a note of the UI log file Carefully read the output of the VMware tools installation to verify the HGFS kernel modules were installed properly.

It would be great if we could get this issue reopened and fixed asap. It really is preventing me from using my vagrant-vmware-workstation license. Retry transaction after doing so. 0x0000025B ERROR_MARSHALL_OVERFLOW The user/kernel marshaling buffer has overflowed. 0x0000025C ERROR_INVALID_VARIANT The supplied variant structure contains invalid data. 0x0000025D ERROR_BAD_COMPRESSION_BUFFER The specified buffer contains ill-formed data. 0x0000025E Please install the VMware tools within the guest and try again.

Perhaps this will be of use for others to create workarounds. The Registry Editor appears. A complete synchronization is required. 0x0000023A ERROR_NET_OPEN_FAILED The NtCreateFile API failed.